Page 1 of 1

OS X Build Error

Posted: Fri Dec 15, 2017 1:05 pm
by cpsmusic
Hi,

I'm just getting started with VSTGUI. I'm using OS X 10.12.6.

When I try to do a build I'm getting the following error:

Code: Select all

CFrameTest
	setZoom [OK] -> 630 µs
	MouseEnterExit [OK] -> 532 µs
	MouseEnterExitInContainer [OK] -> 104 µs
	removeViewWhileMouseInside [OK] -> 21 µs
	focusSettings [OK] -> 80 µs
/bin/sh: line 1: 25301 Segmentation fault: 11  ../../Debug//unittests
make[2]: *** [Debug/unittests] Error 139
make[2]: *** Deleting file `Debug/unittests'
make[1]: *** [tests/unittest/CMakeFiles/unittests.dir/all] Error 2
make: *** [all] Error 2
Any idea how to fix this?

Cheers,

Chris

Re: OS X Build Error

Posted: Mon Dec 18, 2017 4:50 pm
by Arne Scheffler
Hi Chris,
which version are you compiling ?

Cheers,
Arne

Re: OS X Build Error

Posted: Tue Dec 19, 2017 12:46 am
by cpsmusic
Not sure actually - I grabbed a .zip from the GitHub repo on 14/12.

Re: OS X Build Error

Posted: Tue Dec 19, 2017 9:55 am
by Arne Scheffler
Hi Chris,
I've fixed the issues. Please download again.

Cheers,
Arne

Re: OS X Build Error

Posted: Tue Dec 19, 2017 12:54 pm
by cpsmusic
Working now - thanks!