OS X Build Error

A user interface toolkit mainly for audio plug-ins (VST, AudioUnit, etc).
cpsmusic
Posts: 13
Joined: Wed Mar 15, 2017 1:09 pm

OS X Build Error

Postby cpsmusic » Fri Dec 15, 2017 1:05 pm

Hi,

I'm just getting started with VSTGUI. I'm using OS X 10.12.6.

When I try to do a build I'm getting the following error:

Code: Select all

CFrameTest
   setZoom [OK] -> 630 µs
   MouseEnterExit [OK] -> 532 µs
   MouseEnterExitInContainer [OK] -> 104 µs
   removeViewWhileMouseInside [OK] -> 21 µs
   focusSettings [OK] -> 80 µs
/bin/sh: line 1: 25301 Segmentation fault: 11  ../../Debug//unittests
make[2]: *** [Debug/unittests] Error 139
make[2]: *** Deleting file `Debug/unittests'
make[1]: *** [tests/unittest/CMakeFiles/unittests.dir/all] Error 2
make: *** [all] Error 2


Any idea how to fix this?

Cheers,

Chris

Arne Scheffler
Posts: 205
Joined: Mon Jun 20, 2016 7:53 am

Re: OS X Build Error

Postby Arne Scheffler » Mon Dec 18, 2017 4:50 pm

Hi Chris,
which version are you compiling ?

Cheers,
Arne

cpsmusic
Posts: 13
Joined: Wed Mar 15, 2017 1:09 pm

Re: OS X Build Error

Postby cpsmusic » Tue Dec 19, 2017 12:46 am

Not sure actually - I grabbed a .zip from the GitHub repo on 14/12.

Arne Scheffler
Posts: 205
Joined: Mon Jun 20, 2016 7:53 am

Re: OS X Build Error

Postby Arne Scheffler » Tue Dec 19, 2017 9:55 am

Hi Chris,
I've fixed the issues. Please download again.

Cheers,
Arne

cpsmusic
Posts: 13
Joined: Wed Mar 15, 2017 1:09 pm

Re: OS X Build Error

Postby cpsmusic » Tue Dec 19, 2017 12:54 pm

Working now - thanks!


Return to “VSTGUI”

Who is online

Users browsing this forum: No registered users and 0 guests